Encode v3.16 Perl 5 v5.8.5 cygwin-thread
- Status
- Fail
- From
- Peter John Acklam (PJACKLAM)
- Dist
-
Encode v3.16
- Platform
- Perl 5 v5.8.5 cygwin-thread
- Date
- 2021-10-30 12:38:22
- ID
- b21ff49e-6cec-1014-8140-4aac4e73b9b8
This distribution has been tested as part of the CPAN Testers
project, supporting the Perl programming language. See
http://wiki.cpantesters.org/ for more information or email
questions to cpan-testers-discuss@perl.org
--
Dear Dan Kogai,
This is a computer-generated report for Encode-3.16
on perl 5.8.5, created by CPAN-Reporter-1.2018.
Thank you for uploading your work to CPAN. However, there was a problem
testing your distribution.
If you think this report is invalid, please consult the CPAN Testers Wiki
for suggestions on how to avoid getting FAIL reports for missing library
or binary dependencies, unsupported operating systems, and so on:
http://wiki.cpantesters.org/wiki/CPANAuthorNotes
Sections of this report:
* Tester comments
* Program output
* Prerequisites
* Environment and other context
------------------------------
TESTER COMMENTS
------------------------------
Additional comments from tester:
this report is from an automated smoke testing program
and was not reviewed by a human for accuracy
------------------------------
PROGRAM OUTPUT
------------------------------
Output from '/usr/bin/make test':
make[1]: Entering directory '/cygdrive/c/opt/perl5/cygwin_nt-10.0/3.2.0/x86_64/cpan/5.8.5/x86_64-cygwin-thread/build/Encode-3.16-0/Byte'
make[1]: Leaving directory '/cygdrive/c/opt/perl5/cygwin_nt-10.0/3.2.0/x86_64/cpan/5.8.5/x86_64-cygwin-thread/build/Encode-3.16-0/Byte'
make[1]: Entering directory '/cygdrive/c/opt/perl5/cygwin_nt-10.0/3.2.0/x86_64/cpan/5.8.5/x86_64-cygwin-thread/build/Encode-3.16-0/CN'
make[1]: Leaving directory '/cygdrive/c/opt/perl5/cygwin_nt-10.0/3.2.0/x86_64/cpan/5.8.5/x86_64-cygwin-thread/build/Encode-3.16-0/CN'
make[1]: Entering directory '/cygdrive/c/opt/perl5/cygwin_nt-10.0/3.2.0/x86_64/cpan/5.8.5/x86_64-cygwin-thread/build/Encode-3.16-0/EBCDIC'
make[1]: Leaving directory '/cygdrive/c/opt/perl5/cygwin_nt-10.0/3.2.0/x86_64/cpan/5.8.5/x86_64-cygwin-thread/build/Encode-3.16-0/EBCDIC'
make[1]: Entering directory '/cygdrive/c/opt/perl5/cygwin_nt-10.0/3.2.0/x86_64/cpan/5.8.5/x86_64-cygwin-thread/build/Encode-3.16-0/JP'
make[1]: Leaving directory '/cygdrive/c/opt/perl5/cygwin_nt-10.0/3.2.0/x86_64/cpan/5.8.5/x86_64-cygwin-thread/build/Encode-3.16-0/JP'
make[1]: Entering directory '/cygdrive/c/opt/perl5/cygwin_nt-10.0/3.2.0/x86_64/cpan/5.8.5/x86_64-cygwin-thread/build/Encode-3.16-0/KR'
make[1]: Leaving directory '/cygdrive/c/opt/perl5/cygwin_nt-10.0/3.2.0/x86_64/cpan/5.8.5/x86_64-cygwin-thread/build/Encode-3.16-0/KR'
make[1]: Entering directory '/cygdrive/c/opt/perl5/cygwin_nt-10.0/3.2.0/x86_64/cpan/5.8.5/x86_64-cygwin-thread/build/Encode-3.16-0/Symbol'
make[1]: Leaving directory '/cygdrive/c/opt/perl5/cygwin_nt-10.0/3.2.0/x86_64/cpan/5.8.5/x86_64-cygwin-thread/build/Encode-3.16-0/Symbol'
make[1]: Entering directory '/cygdrive/c/opt/perl5/cygwin_nt-10.0/3.2.0/x86_64/cpan/5.8.5/x86_64-cygwin-thread/build/Encode-3.16-0/TW'
make[1]: Leaving directory '/cygdrive/c/opt/perl5/cygwin_nt-10.0/3.2.0/x86_64/cpan/5.8.5/x86_64-cygwin-thread/build/Encode-3.16-0/TW'
make[1]: Entering directory '/cygdrive/c/opt/perl5/cygwin_nt-10.0/3.2.0/x86_64/cpan/5.8.5/x86_64-cygwin-thread/build/Encode-3.16-0/Unicode'
make[1]: Leaving directory '/cygdrive/c/opt/perl5/cygwin_nt-10.0/3.2.0/x86_64/cpan/5.8.5/x86_64-cygwin-thread/build/Encode-3.16-0/Unicode'
PERL_DL_NONLAZY=1 /cygdrive/c/opt/perl5/cygwin_nt-10.0/3.2.0/x86_64/perl/5.8.5/x86_64-cygwin-thread/bin/perl5.8.5.exe "-MExtUtils::Command::MM" "-e" "test_harness(0, 'blib/lib', 'blib/arch')" t/*.t
t/Aliases..................ok
t/at-cn....................ok
t/at-tw....................ok
t/CJKT.....................ok
t/cow......................ok
t/decode...................ok
5/17 skipped: various reasons
t/enc_data.................ok
t/enc_eucjp................ok
t/enc_module...............ok
t/enc_utf8.................ok
t/Encode...................ok
1/2722 skipped: Perl Version (5.008005) is older than v5.16
t/Encoder..................ok
t/encoding-locale..........ok
t/encoding.................ok
t/fallback.................ok
t/from_to..................ok
t/grow.....................ok
t/gsm0338..................\x1B does not map to Unicode at t/gsm0338.t line 89
\x1B does not map to Unicode at t/gsm0338.t line 89
# Failed test 'PerlIO encoding(gsm0338) read works'
# at t/gsm0338.t line 91.
Wide character in print at /opt/perl5/cygwin_nt-10.0/3.2.0/x86_64/perl/5.8.5/x86_64-cygwin-thread/local/lib/5.8.5/Test2/Formatter/TAP.pm line 125.
# got: 'A≉‰‰‰‰‰‰‰‰‰‰‰‰‰‰‰‰‰‰‰‰‰‰‰‰‰‰‰‰‰‰‰‰‰‰‰‰‰‰‰‰‰‰‰‰‰‰‰‰‰‰‰‰‰‰‰‰‰‰‰‰‰‰‰‰‰‰‰‰‰‰‰‰‰‰‰‰‰‰‰‰‰‰‰‰‰‰‰‰‰‰‰‰‰‰‰‰‰‰‰‰‰‰‰‰‰‰‰‰‰‰‰‰‰‰‰‰‰‰‰‰‰‰‰‰‰‰‰‰‰‰‰‰‰‰‰‰‰‰‰‰‰‰‰‰‰‰‰‰‰‰‰‰‰‰‰‰‰‰‰‰‰‰‰‰‰‰‰‰‰‰‰‰‰‰‰‰‰‰‰‰‰‰‰‰‰‰‰‰‰‰‰‰‰‰‰‰‰‰‰‰‰‰‰‰‰‰‰‰‰‰‰‰‰‰‰‰‰‰‰‰‰‰‰‰‰‰‰‰‰‰‰‰‰‰‰‰‰‰‰‰‰‰‰‰‰‰‰‰‰‰‰‰‰‰‰‰‰‰‰‰‰‰‰‰‰‰‰‰‰‰‰‰‰‰‰‰‰‰‰‰‰‰‰‰‰‰‰‰‰‰‰‰‰‰‰‰‰‰‰‰‰‰‰‰‰‰‰‰‰‰‰‰‰‰‰‰‰‰‰‰‰‰‰‰‰‰‰‰‰‰‰‰‰‰‰‰‰‰‰‰‰‰‰‰‰‰‰‰‰‰‰‰‰‰‰‰‰‰‰‰‰‰‰‰‰‰‰‰‰‰‰‰‰‰‰‰‰‰‰‰‰‰‰‰‰‰‰‰‰‰‰‰‰‰‰‰‰‰‰‰‰‰‰‰‰‰‰‰‰‰‰‰‰‰‰‰‰‰‰‰‰‰‰‰‰‰‰‰‰‰‰‰‰‰‰‰‰‰‰‰‰‰‰‰‰‰‰‰‰‰‰‰‰‰‰‰‰‰‰‰‰‰‰‰‰‰‰‰‰‰‰‰‰‰‰‰‰‰‰‰‰‰‰‰‰‰‰‰‰‰‰‰‰‰‰‰‰‰‰‰‰‰‰‰‰‰‰‰¬�e≉‰‰‰‰‰‰‰‰‰‰‰‰‰‰‰‰‰‰‰‰‰‰‰‰‰‰‰‰‰‰‰‰‰‰‰‰‰‰‰‰‰‰‰‰‰‰‰‰‰‰‰‰‰‰‰‰‰‰‰‰‰‰‰‰‰‰‰‰‰‰‰‰‰‰‰‰‰‰‰‰‰‰‰‰‰‰‰‰‰‰‰‰‰‰‰‰‰‰‰‰‰‰‰‰‰‰‰‰‰‰‰‰‰‰‰‰‰‰‰‰‰‰‰‰‰‰‰‰‰‰‰‰‰‰‰‰‰‰‰‰‰‰‰‰‰‰‰‰‰‰‰‰‰‰‰‰‰‰‰‰‰‰‰‰‰‰‰‰‰‰‰‰‰‰‰‰‰‰‰‰‰‰‰‰‰‰‰‰‰‰‰‰‰‰‰‰‰‰‰‰‰‰‰‰‰‰‰‰‰‰‰‰‰‰‰‰‰‰‰‰‰‰‰‰‰‰‰‰‰‰‰‰‰‰‰‰‰‰‰‰‰‰‰‰‰‰‰‰‰‰‰‰‰‰‰‰‰‰‰‰‰‰‰‰‰‰‰‰‰‰‰‰‰‰‰‰‰‰‰‰‰‰‰‰‰‰‰‰‰‰‰‰‰‰‰‰‰‰‰‰‰‰‰‰‰‰‰‰‰‰‰‰‰‰‰‰‰‰‰‰‰‰‰‰‰‰‰‰‰‰‰‰‰‰‰‰‰‰‰‰‰‰‰‰‰‰‰‰‰‰‰‰‰‰‰‰‰‰‰‰‰‰‰‰‰‰‰‰‰‰‰‰‰‰‰‰‰‰‰‰‰‰‰‰‰‰‰‰‰‰‰‰‰‰‰‰‰‰‰‰‰‰‰‰‰‰‰‰‰‰‰‰‰‰‰‰‰‰‰‰‰‰‰‰‰‰‰‰‰‰‰‰‰‰‰‰‰‰‰‰‰‰‰‰‰‰‰‰‰‰‰‰‰‰‰‰‰‰‰‰‰‰‰‰‰‰‰‰‰‰‰‰‰‰‰‰‰‰‰‰‰‰‰‰‰‰‰‰‰‰‰‰‰‰‰‰‰‰‰‰‰‰‰‰‰‰‰‰¬�e'
# expected: 'A≉‰‰‰‰‰‰‰‰‰‰‰‰‰‰‰‰‰‰‰‰‰‰‰‰‰‰‰‰‰‰‰‰‰‰‰‰‰‰‰‰‰‰‰‰‰‰‰‰‰‰‰‰‰‰‰‰‰‰‰‰‰‰‰‰‰‰‰‰‰‰‰‰‰‰‰‰‰‰‰‰‰‰‰‰‰‰‰‰‰‰‰‰‰‰‰‰‰‰‰‰‰‰‰‰‰‰‰‰‰‰‰‰‰‰‰‰‰‰‰‰‰‰‰‰‰‰‰‰‰‰‰‰‰‰‰‰‰‰‰‰‰‰‰‰‰‰‰‰‰‰‰‰‰‰‰‰‰‰‰‰‰‰‰‰‰‰‰‰‰‰‰‰‰‰‰‰‰‰‰‰‰‰‰‰‰‰‰‰‰‰‰‰‰‰‰‰‰‰‰‰‰‰‰‰‰‰‰‰‰‰‰‰‰‰‰‰‰‰‰‰‰‰‰‰‰‰‰‰‰‰‰‰‰‰‰‰‰‰‰‰‰‰‰‰‰‰‰‰‰‰‰‰‰‰‰‰‰‰‰‰‰‰‰‰‰‰‰‰‰‰‰‰‰‰‰‰‰‰‰‰‰‰‰‰‰‰‰‰‰‰‰‰‰‰‰‰‰‰‰‰‰‰‰‰‰‰‰‰‰‰‰‰‰‰‰‰‰‰‰‰‰‰‰‰‰‰‰‰‰‰‰‰‰‰‰‰‰‰‰‰‰‰‰‰‰‰‰‰‰‰‰‰‰‰‰‰‰‰‰‰‰‰‰‰‰‰‰‰‰‰‰‰‰‰‰‰‰‰‰‰‰‰‰‰‰‰‰‰‰‰‰‰‰‰‰‰‰‰‰‰‰‰‰‰‰‰‰‰‰‰‰‰‰‰‰‰‰‰‰‰‰‰‰‰‰‰‰‰‰‰‰‰‰‰‰‰‰‰‰‰‰‰‰‰‰‰‰‰‰‰‰‰‰‰‰‰‰‰‰‰‰‰‰‰‰‰‰‰‰‰‰‰‰‰‰‰‰‰‰‰‰‰‰‰‰‰‰‰‰‰‰‰‰‰‰‰‰‰‰‰‰‰‰‰‰‰‰‰‰‰‰‰‰‰‰‰‰‰‰‰‰‰‰‰‰‰‰‰‰‰‰‰‰‰‰‰‰‰‰‰‰‰‰‰‰‰‰‰‰‰‰‰‰‰‰‰‰‰‰‰‰‰‰‰‰‰‰‰‰‰‰‰‰‰‰‰‰‰‰‰‰‰‰‰‰‰‰‰‰‰‰‰‰‰‰‰‰‰‰‰‰‰‰‰‰‰‰‰‰‰‰‰‰‰‰‰‰‰‰‰‰‰‰‰‰‰‰‰‰‰‰‰‰‰‰‰‰‰‰‰‰‰‰‰‰‰‰‰‰‰‰‰‰‰‰‰‰‰‰‰‰‰‰‰‰‰‰‰‰‰‰‰‰‰‰‰‰‰‰‰‰‰‰‰‰‰‰‰‰‰‰‰‰‰‰‰‰‰‰‰‰‰‰‰‰‰‰‰‰‰‰‰‰‰‰‰‰‰‰‰‰‰‰‰‰‰‰‰‰‰‰‰‰‰‰‰‰‰‰‰‰‰‰‰‰‰‰‰‰‰‰‰‰‰‰‰‰‰‰‰‰‰‰‰‰‰‰‰‰‰‰‰‰‰‰‰‰‰‰‰‰‰‰‰‰‰‰‰‰‰‰‰‰‰‰‰‰‰‰‰‰‰‰‰‰‰‰‰‰‰‰‰‰‰‰‰‰‰‰‰‰‰‰‰‰‰‰‰‰‰‰‰‰‰‰‰‰‰‰‰‰‰‰‰‰‰‰‰‰‰‰‰‰‰‰‰‰‰‰‰‰‰‰‰‰‰‰‰‰‰‰‰‰‰‰‰‰‰‰‰‰‰‰‰‰‰‰‰‰‰‰‰‰‰‰‰‰‰‰‰‰‰‰‰‰‰‰‰‰‰‰‰‰‰‰‰‰‰‰‰‰‰‰‰‰‰‰‰‰‰‰‰‰‰‰‰‰‰‰‰‰‰‰‰‰‰‰‰‰‰‰‰‰‰‰‰‰‰‰‰‰‰‰‰‰‰‰‰‰‰‰‰‰‰‰‰‰‰‰‰‰‰‰‰‰‰‰‰‰‰‰‰‰‰‰‰‰‰‰‰‰‰‰‰‰‰‰‰‰‰‰‰‰‰‰‰‰‰‰‰‰¬'
# Looks like you failed 1 test of 777.
dubious
Test returned status 1 (wstat 256, 0x100)
DIED. FAILED test 777
Failed 1/777 tests, 99.87% okay
t/guess....................ok
t/isa......................ok
t/jis7-fallback............ok
t/jperl....................ok
t/magic....................ok
t/mime-header..............dubious
Test returned status 0 (wstat 139, 0x8b)
test program seems to have generated a core
DIED. FAILED tests 208-266
Failed 59/266 tests, 77.82% okay
t/mime-name................ok
t/mime_header_iso2022jp....ok
t/perlio...................ok
t/piconv...................ok
t/rt113164.................ok
t/rt65541..................ok
t/rt76824..................ok
t/rt85489..................ok
t/rt86327..................ok
t/taint....................ok
t/truncated_utf8...........ok
2/9 skipped: Perl Version (5.008005) is older than v5.8.9
t/undef....................ok
t/Unicode..................ok
t/Unicode_trailing_nul.....# temp file: /tmp/E2cEYSQFns
ok
t/use-Encode-Alias.........ok
t/utf8ref..................ok
t/utf8strict...............ok
t/utf8warnings.............ok
t/whatwg-aliases...........skipped
all skipped: For maintainers only
t/xml......................ok
Failed 2/44 test scripts, 95.45% okay. 60/7778 subtests failed, 99.23% okay.
Failed Test Stat Wstat Total Fail Failed List of Failed
-------------------------------------------------------------------------------
t/gsm0338.t 1 256 777 1 0.13% 777
t/mime-header.t 0 139 266 118 44.36% 208-266
1 test and 8 subtests skipped.
make: *** [Makefile:1409: test_dynamic] Error 255
------------------------------
PREREQUISITES
------------------------------
Prerequisite modules loaded:
requires:
Module Need Have
------------------- ----- --------
Exporter 5.57 5.58
parent 0.221 0.238
Storable 0 2.13
build_requires:
Module Need Have
------------------- ----- --------
ExtUtils::MakeMaker 0 6.68
Test::More 0.92 1.302188
configure_requires:
Module Need Have
------------------- ----- --------
ExtUtils::MakeMaker 0 6.68
------------------------------
ENVIRONMENT AND OTHER CONTEXT
------------------------------
Environment variables:
AUTOMATED_TESTING = 1
COMSPEC = C:\WINDOWS\system32\cmd.exe
LDFLAGS = -Wl,-rpath,/usr/local/lib -L/usr/local/lib
NONINTERACTIVE_TESTING = 1
NUMBER_OF_PROCESSORS = 12
PATH = /usr/site/gcc-11.2.0/bin:/opt/perl5/cygwin_nt-10.0/3.2.0/x86_64/perl/5.8.5/x86_64-cygwin-thread/bin:/opt/perl5/cygwin_nt-10.0/3.2.0/x86_64/perl/5.8.5/x86_64-cygwin-thread/local/bin:/usr/bin:/bin:/usr/local/bin
PERL5LIB = /opt/perl5/cygwin_nt-10.0/3.2.0/x86_64/cpan/5.8.5/x86_64-cygwin-thread/build/parent-0.238-0/blib/arch:/opt/perl5/cygwin_nt-10.0/3.2.0/x86_64/cpan/5.8.5/x86_64-cygwin-thread/build/parent-0.238-0/blib/lib:/opt/perl5/cygwin_nt-10.0/3.2.0/x86_64/cpan/5.8.5/x86_64-cygwin-thread/build/Pod-Simple-3.43-0/blib/arch:/opt/perl5/cygwin_nt-10.0/3.2.0/x86_64/cpan/5.8.5/x86_64-cygwin-thread/build/Pod-Simple-3.43-0/blib/lib:/opt/perl5/cygwin_nt-10.0/3.2.0/x86_64/cpan/5.8.5/x86_64-cygwin-thread/build/Pod-Escapes-1.07-0/blib/arch:/opt/perl5/cygwin_nt-10.0/3.2.0/x86_64/cpan/5.8.5/x86_64-cygwin-thread/build/Pod-Escapes-1.07-0/blib/lib:/opt/perl5/cygwin_nt-10.0/3.2.0/x86_64/perl/5.8.5/x86_64-cygwin-thread/local/lib/site_perl:/opt/perl5/cygwin_nt-10.0/3.2.0/x86_64/perl/5.8.5/x86_64-cygwin-thread/local/lib/perl5:/opt/perl5/cygwin_nt-10.0/3.2.0/x86_64/perl/5.8.5/x86_64-cygwin-thread/local/lib
PERL5OPT =
PERL5_CPANPLUS_IS_RUNNING = 17247
PERL5_CPAN_IS_RUNNING = 17247
PERL_CANARY_STABILITY_NOPROMPT = 1
PERL_CPAN_REPORTER_CONFIG = /cygdrive/c/peter/.cpanreporter/config-cygwin-OS-A01-L0123.ini
PERL_EXTUTILS_AUTOINSTALL = 1
PERL_MM_USE_DEFAULT = 1
PERL_TEST_CRITIC = 1
PERL_TEST_CRITIC = 1
PERL_TEST_POD = 1
PERL_TEST_POD = 1
PERL_USE_UNSAFE_INC = 1
POD_TESTING = 1
POD_TESTS = 1
PROCESSOR_IDENTIFIER = Intel64 Family 6 Model 158 Stepping 10, GenuineIntel
SHELL = /bin/bash
TEMP = /tmp
TERM = xterm
Perl special variables (and OS-specific diagnostics, for MSWin32):
$^X = /cygdrive/c/opt/perl5/cygwin_nt-10.0/3.2.0/x86_64/perl/5.8.5/x86_64-cygwin-thread/bin/perl5.8.5
$UID/$EUID = 1061331 / 1061331
$GID = 1049089 401408 1083352 1136188 1049147 70145 1081620 1154615 1069144 1137882 1111057 1146142 1139332 1144155 1075170 1095782 1081637 1068897 1090492 1090104 1059531 1069945 1139179 1152552 1125495 1152548 1049649 1135663 1150082 1105777 1087957 1138328 1089865 1059243 1104220 1051354 1100278 1089132 1057337 1056539 1138202 1068783 1141985 1057394 1051228 1122107 1093944 1090906 1151869 1138331 1143577 1088201 1137546 1137338 1125494 1122108 1081942 1058653 1061909 1090413 1081310 1141767 1090502 1139839 1089123 1113266 1051245 1098011 1150627 1104222 66048 4095 15 11 66049 4 545 1049089
$EGID = 1049089 401408 1083352 1136188 1049147 70145 1081620 1154615 1069144 1137882 1111057 1146142 1139332 1144155 1075170 1095782 1081637 1068897 1090492 1090104 1059531 1069945 1139179 1152552 1125495 1152548 1049649 1135663 1150082 1105777 1087957 1138328 1089865 1059243 1104220 1051354 1100278 1089132 1057337 1056539 1138202 1068783 1141985 1057394 1051228 1122107 1093944 1090906 1151869 1138331 1143577 1088201 1137546 1137338 1125494 1122108 1081942 1058653 1061909 1090413 1081310 1141767 1090502 1139839 1089123 1113266 1051245 1098011 1150627 1104222 66048 4095 15 11 66049 4 545 1049089
Perl module toolchain versions installed:
Module Have
------------------- --------
CPAN 2.28
CPAN::Meta 2.150010
Cwd 3.75
ExtUtils::CBuilder 0.280236
ExtUtils::Command 1.16
ExtUtils::Install 1.54
ExtUtils::MakeMaker 6.68
ExtUtils::Manifest 1.60
ExtUtils::ParseXS 3.35
File::Spec 3.75
JSON n/a
JSON::PP 4.06
Module::Build n/a
Module::Signature n/a
Parse::CPAN::Meta 2.150010
Test::Harness 2.42
Test::More 1.302188
YAML 1.30
YAML::Syck n/a
version 0.88
--
Summary of my perl5 (revision 5 version 8 subversion 5) configuration:
Platform:
osname=cygwin, osvers=3.2.0(0.34053), archname=cygwin-thread
uname='cygwin_nt-10.0 os-a01-l0123 3.2.0(0.34053) 2021-03-29 08:42 x86_64 cygwin '
config_args='-de -Dmksymlinks -Uinc_version_list -Uinstallusrbinperl -Dcc=gcc -Dld=g++ -Dusethreads -Uusemultiplicity -Dprefix=/opt/perl5/cygwin_nt-10.0/3.2.0/x86_64/perl/5.8.5/x86_64-cygwin-thread -Darchname=x86_64-cygwin-thread'
hint=recommended, useposix=true, d_sigaction=define
usethreads=define use5005threads=undef useithreads=define usemultiplicity=undef
useperlio=define d_sfio=undef uselargefiles=define usesocks=undef
use64bitint=define use64bitall=define uselongdouble=undef
usemymalloc=n, bincompat5005=undef
Compiler:
cc='gcc', ccflags ='-DPERL_USE_SAFE_PUTENV -fpcc-struct-return -pipe -I/usr/local/include',
optimize='-O2',
cppflags='-DPERL_USE_SAFE_PUTENV -fpcc-struct-return -pipe -I/usr/local/include -D__GNUC__'
ccversion='', gccversion='11.2.0', gccosandvers=''
intsize=4, longsize=8, ptrsize=8, doublesize=8, byteorder=12345678
d_longlong=define, longlongsize=8, d_longdbl=define, longdblsize=16
ivtype='long', ivsize=8, nvtype='double', nvsize=8, Off_t='off_t', lseeksize=8
alignbytes=8, prototype=define
Linker and Libraries:
ld='ld2', ldflags =' -L/usr/local/lib'
libpth=/usr/local/lib /usr/lib /lib
libs=-ldl
perllibs=-ldl
libc=/usr/lib/libc.a, so=dll, useshrplib=true, libperl=libperl.a
gnulibc_version=''
Dynamic Linking:
dlsrc=dl_dlopen.xs, dlext=dll, d_dlsymun=undef, ccdlflags=' '
cccdlflags=' ', lddlflags=' -L/usr/local/lib'
Characteristics of this binary (from libperl):
Compile-time options: MULTIPLICITY USE_ITHREADS USE_64_BIT_INT USE_64_BIT_ALL USE_LARGE_FILES PERL_IMPLICIT_CONTEXT
Built under cygwin
Compiled at Oct 5 2021 11:43:20
%ENV:
PERL="/cygdrive/c/opt/perl5/cygwin_nt-10.0/3.2.0/x86_64/perl/5.8.5/x86_64-cygwin-thread/bin/perl5.8.5"
PERL5LIB="/opt/perl5/cygwin_nt-10.0/3.2.0/x86_64/cpan/5.8.5/x86_64-cygwin-thread/build/parent-0.238-0/blib/arch:/opt/perl5/cygwin_nt-10.0/3.2.0/x86_64/cpan/5.8.5/x86_64-cygwin-thread/build/parent-0.238-0/blib/lib:/opt/perl5/cygwin_nt-10.0/3.2.0/x86_64/cpan/5.8.5/x86_64-cygwin-thread/build/Pod-Simple-3.43-0/blib/arch:/opt/perl5/cygwin_nt-10.0/3.2.0/x86_64/cpan/5.8.5/x86_64-cygwin-thread/build/Pod-Simple-3.43-0/blib/lib:/opt/perl5/cygwin_nt-10.0/3.2.0/x86_64/cpan/5.8.5/x86_64-cygwin-thread/build/Pod-Escapes-1.07-0/blib/arch:/opt/perl5/cygwin_nt-10.0/3.2.0/x86_64/cpan/5.8.5/x86_64-cygwin-thread/build/Pod-Escapes-1.07-0/blib/lib:/opt/perl5/cygwin_nt-10.0/3.2.0/x86_64/perl/5.8.5/x86_64-cygwin-thread/local/lib/site_perl:/opt/perl5/cygwin_nt-10.0/3.2.0/x86_64/perl/5.8.5/x86_64-cygwin-thread/local/lib/perl5:/opt/perl5/cygwin_nt-10.0/3.2.0/x86_64/perl/5.8.5/x86_64-cygwin-thread/local/lib"
PERL5OPT=""
PERL5_CPANPLUS_IS_RUNNING="17247"
PERL5_CPAN_IS_EXECUTING="/opt/perl5/cygwin_nt-10.0/3.2.0/x86_64/cpan/5.8.5/x86_64-cygwin-thread/build/parent-0.238-0/Makefile.PL"
PERL5_CPAN_IS_RUNNING="17247"
PERL_AUTOINSTALL="--defaultdeps"
PERL_CANARY_STABILITY_NOPROMPT="1"
PERL_CPAN_REPORTER_CONFIG="/cygdrive/c/peter/.cpanreporter/config-cygwin-OS-A01-L0123.ini"
PERL_EXTUTILS_AUTOINSTALL="1"
PERL_MM_USE_DEFAULT="1"
PERL_TEST_CRITIC="1"
PERL_TEST_POD="1"
PERL_USE_UNSAFE_INC="1"
CYGWIN=""
@INC:
/opt/perl5/cygwin_nt-10.0/3.2.0/x86_64/cpan/5.8.5/x86_64-cygwin-thread/build/parent-0.238-0/blib/arch
/opt/perl5/cygwin_nt-10.0/3.2.0/x86_64/cpan/5.8.5/x86_64-cygwin-thread/build/parent-0.238-0/blib/lib
/opt/perl5/cygwin_nt-10.0/3.2.0/x86_64/cpan/5.8.5/x86_64-cygwin-thread/build/Pod-Simple-3.43-0/blib/arch
/opt/perl5/cygwin_nt-10.0/3.2.0/x86_64/cpan/5.8.5/x86_64-cygwin-thread/build/Pod-Simple-3.43-0/blib/lib
/opt/perl5/cygwin_nt-10.0/3.2.0/x86_64/cpan/5.8.5/x86_64-cygwin-thread/build/Pod-Escapes-1.07-0/blib/arch
/opt/perl5/cygwin_nt-10.0/3.2.0/x86_64/cpan/5.8.5/x86_64-cygwin-thread/build/Pod-Escapes-1.07-0/blib/lib
/opt/perl5/cygwin_nt-10.0/3.2.0/x86_64/perl/5.8.5/x86_64-cygwin-thread/local/lib/site_perl/5.8.5/cygwin-thread
/opt/perl5/cygwin_nt-10.0/3.2.0/x86_64/perl/5.8.5/x86_64-cygwin-thread/local/lib/site_perl/5.8.5
/opt/perl5/cygwin_nt-10.0/3.2.0/x86_64/perl/5.8.5/x86_64-cygwin-thread/local/lib/site_perl
/opt/perl5/cygwin_nt-10.0/3.2.0/x86_64/perl/5.8.5/x86_64-cygwin-thread/local/lib/perl5/5.8.5
/opt/perl5/cygwin_nt-10.0/3.2.0/x86_64/perl/5.8.5/x86_64-cygwin-thread/local/lib/perl5
/opt/perl5/cygwin_nt-10.0/3.2.0/x86_64/perl/5.8.5/x86_64-cygwin-thread/local/lib/5.8.5/cygwin-thread
/opt/perl5/cygwin_nt-10.0/3.2.0/x86_64/perl/5.8.5/x86_64-cygwin-thread/local/lib/5.8.5
/opt/perl5/cygwin_nt-10.0/3.2.0/x86_64/perl/5.8.5/x86_64-cygwin-thread/local/lib
/opt/perl5/cygwin_nt-10.0/3.2.0/x86_64/perl/5.8.5/x86_64-cygwin-thread/lib/5.8.5/cygwin-thread
/opt/perl5/cygwin_nt-10.0/3.2.0/x86_64/perl/5.8.5/x86_64-cygwin-thread/lib/5.8.5
/opt/perl5/cygwin_nt-10.0/3.2.0/x86_64/perl/5.8.5/x86_64-cygwin-thread/lib/site_perl/5.8.5/cygwin-thread
/opt/perl5/cygwin_nt-10.0/3.2.0/x86_64/perl/5.8.5/x86_64-cygwin-thread/lib/site_perl/5.8.5
/opt/perl5/cygwin_nt-10.0/3.2.0/x86_64/perl/5.8.5/x86_64-cygwin-thread/lib/site_perl
.